{"text_format":"1","workbook":"xlsx","n_sheets":7,"sheets":["カロリー計算","マグネシウム","カルシウム","成分追加用マスター","体重の記録","体重グラフ","フードの切替計画書"],"not_rendered":{"charts":2,"images":0,"macros":0,"external_links":0,"defined_names":4,"comments":0,"pivot_tables":0},"unopened":[{"sheet":"体重グラフ","index":5,"reason":"not_a_worksheet"}],"bounds":{"document_bytes":16777216,"sheet_cells":100000,"rows_first":2000,"rows_last":500,"rows_between":2000,"halvings":0,"cell_chars":16384,"cell_head_chars":4096},"cells_cut":0,"cells_raw":0,"read":"whole","date_system":"1900"}

{"sheet":"カロリー計算","index":0,"n_rows":23,"n_cols":12,"rows_kept":23,"cut":false,"hidden":false,"merged":[[1,1,1,8],[17,1,17,7],[18,1,18,2],[29,1,29,8],[2,4,2,5],[2,6,2,7],[18,6,18,7],[28,1,28,8],[19,1,20,2],[25,1,25,8],[31,1,31,8],[30,1,30,8],[27,1,27,8],[19,6,19,7],[20,6,20,8],[23,1,23,8],[24,1,24,8],[26,1,26,8]]}
[]
[null,"みる 2014/1/28生"]
[null,"時刻","フード","タイプ","熱量 (カタログ値)",null,"一日給餌量",null,"エネルギー\n( Kcal )",null,null,"印刷範囲外計算枠"]
[null,"日計","FHN　エクシジェント42","ドライ",387,"Kcal/100g",8,"g",{"$f":"(INT(L4*100))/100","v":30.96},null,null,{"$f":"IF(F4=\"Kcal/Kg\",E4*G4/1000,IF(F4=\"Kcal/100g\",E4*G4/100,E4*G4))","v":30.96}]
[null,"日計","FHN　インドア　7+","ドライ",380,"Kcal/100g",8,"g",{"$f":"(INT(L5*100))/100","v":30.4},null,null,{"$f":"IF(F5=\"Kcal/Kg\",E5*G5/1000,IF(F5=\"Kcal/100g\",E5*G5/100,E5*G5))","v":30.4}]
[null,"日計","FHN ステアライズド　7+","ドライ",350,"Kcal/100g",8,"g",28,null,null,28]
[null,"日計","ウルトラライト (85g　パウチ)","ウェット",69,"Kcal/100g",85,"g",58.65,null,null,58.65]
[null,"日計","おやつ各種、少量","おやつ",40,"Kcal/個",0.5,"個",20,null,null,20]
[null,null,"　",null,null,null,0,null,0,null,null,0]
[null,null,"　",null,null,null,null,null,0,null,null,0]
[null,null,"　",null,null,null,null,null,0,null,null,0]
[null,null,"　",null,null,null,null,null,0,null,null,0]
[null,null,"　",null,null,null,null,null,0,null,null,0]
[null,null,"　",null,0,null,0,null,0,null,null,0]
[null,null,"　",null,null,null,null,null,0,null,null,0]
[null,null,"　",null,null,null,null,null,0,null,null,0]
[null,null,"　",null,0,null,0,null,0,null,null,0]
[null,"一日摂取合計 Kcal 　",null,null,null,null,null,null,{"$f":"SUM(I4:I17)","v":168.01}]
[null,"2023-09-30",null,"体　重",{"$f":"体重の記録!D241","v":5.85},"Kg","目標 Kcal",null,{"$f":"IF(F19=\"g\",E19*E20/1000,IF(F19=\"Kg\",E19*E20,0))","v":163.79999999999998}]
[null," 体重に対する基本のエネルギー量は成猫で80Kcal/Kg。　室内飼いの場合は70Kcal/Kg で計算する。1歳までの子猫は100～200Kcal/Kgで計算。 体重の変化や運動量で適宜増減する。",null,"基本熱量",28,"Kcal/Kg","過不足 %",null,{"$f":"(I18/I19*100)-100","v":2.5702075702075859}]
[null,null,null,"許容差±",10,"％",{"$f":"IF((I18/I19)<(1-(E21/100)),\"※不足しています\",IF((I18/I19)>(1+(E21/100)),\"※超過しています\",\"※摂取量は適正です\"))","v":"※摂取量は適正です"}]
[]
[null," MEMO : "]

{"sheet":"マグネシウム","index":1,"n_rows":23,"n_cols":14,"rows_kept":23,"cut":false,"hidden":false,"merged":[[17,1,17,4],[14,1,14,4],[15,1,15,4],[16,1,16,4],[6,1,6,4],[7,1,7,4],[8,1,8,4],[18,1,18,3],[20,1,20,7],[19,1,19,2],[19,3,19,4],[19,6,19,7],[18,6,18,7],[18,4,18,5],[2,4,2,7],[3,6,3,7],[1,1,1,9],[13,1,13,4],[9,1,9,4],[10,1,10,4],[3,8,3,9],[11,1,11,4],[12,1,12,4],[5,1,5,4],[3,1,3,4],[4,1,4,4],[23,1,23,9],[24,1,24,9],[28,1,28,9],[30,1,30,9],[25,1,25,9],[26,1,26,9],[27,1,27,9],[29,1,29,9]]}
[]
[null,{"$f":"CONCATENATE(カロリー計算!B2,\" の栄養素管理\")","v":"みる 2014/1/28生 の栄養素管理"}]
[null,"種　別","ミネラル","管　理\n成分名","マグネシウム",null,null,null,"判定法","Max"]
[null,"フード名",null,null,null,"タイプ","含有量／単位",null,"一日摂取量",null,null,null,null,"印刷範囲外計算枠"]
[null,{"$f":"カロリー計算!$C$4","v":"FHN　エクシジェント42"},null,null,null,{"$f":"カロリー計算!$D$4","v":"ドライ"},0.08,"%",{"$f":"IF(H5=\"%\",IF(G5<1,カロリー計算!G4*マグネシウム!G5*10,カロリー計算!G4*マグネシウム!G5/100),IF(H5=\"Kcal/Kg\",カロリー計算!G4*G5/1000,IF(H5=\"mg/Kg\",カロリー計算!G4*G5/1000,IF(H5=\"IU/Kg\",カロリー計算!G4*G5/1000,G5))))","v":6.4},{"$f":"IF(H5=\"%\",IF(G5<1,\"mg\",\"g\"),IF(H5=\"Kcal/Kg\",\"Kcal\",IF(H5=\"mg/Kg\",\"mg\",IF(H5=\"IU/Kg\",\"IU\",IF(H5=\"pH\",\"pH\",\"---\")))))","v":"mg"},null,null,null,{"$f":"IF(J5=\"g\",INT(I5*1000),IF(J5=\"pH\",0,I5))","v":6.4}]
[null,{"$f":"カロリー計算!$C$5","v":"FHN　インドア　7+"},null,null,null,{"$f":"カロリー計算!$D$5","v":"ドライ"},0.08,"%",{"$f":"IF(H6=\"%\",IF(G6<1,カロリー計算!G5*マグネシウム!G6*10,カロリー計算!G5*マグネシウム!G6/100),IF(H6=\"Kcal/Kg\",カロリー計算!G5*G6/1000,IF(H6=\"mg/Kg\",カロリー計算!G5*G6/1000,IF(H6=\"IU/Kg\",カロリー計算!G5*G6/1000,G6))))","v":6.4},"mg",null,null,null,{"$f":"IF(J6=\"g\",INT(I6*1000),IF(J6=\"pH\",0,I6))","v":6.4}]
[null,{"$f":"カロリー計算!$C$6","v":"FHN ステアライズド　7+"},null,null,null,{"$f":"カロリー計算!$D$6","v":"ドライ"},7.0000000000000007E-2,"%",{"$f":"IF(H7=\"%\",IF(G7<1,カロリー計算!G6*マグネシウム!G7*10,カロリー計算!G6*マグネシウム!G7/100),IF(H7=\"Kcal/Kg\",カロリー計算!G6*G7/1000,IF(H7=\"mg/Kg\",カロリー計算!G6*G7/1000,IF(H7=\"IU/Kg\",カロリー計算!G6*G7/1000,G7))))","v":5.6000000000000005},"mg",null,null,null,5.6000000000000005]
[null,{"$f":"カロリー計算!$C$7","v":"ウルトラライト (85g　パウチ)"},null,null,null,{"$f":"カロリー計算!$D$7","v":"ウェット"},2.5999999999999999E-2,"%",{"$f":"IF(H8=\"%\",IF(G8<1,カロリー計算!G7*マグネシウム!G8*10,カロリー計算!G7*マグネシウム!G8/100),IF(H8=\"Kcal/Kg\",カロリー計算!G7*G8/1000,IF(H8=\"mg/Kg\",カロリー計算!G7*G8/1000,IF(H8=\"IU/Kg\",カロリー計算!G7*G8/1000,G8))))","v":22.1},"mg",null,null,null,22.1]
[null,{"$f":"カロリー計算!$C$8","v":"おやつ各種、少量"},null,null,null,{"$f":"カロリー計算!$D$8","v":"おやつ"},null,null,{"$f":"IF(H9=\"%\",IF(G9<1,カロリー計算!G8*マグネシウム!G9*10,カロリー計算!G8*マグネシウム!G9/100),IF(H9=\"Kcal/Kg\",カロリー計算!G8*G9/1000,IF(H9=\"mg/Kg\",カロリー計算!G8*G9/1000,IF(H9=\"IU/Kg\",カロリー計算!G8*G9/1000,G9))))","v":0},"---",null,null,null,0]
[null,{"$f":"カロリー計算!$C$9","v":"　"},null,null,null,{"$f":"カロリー計算!$D$9","v":0},null,null,{"$f":"IF(H10=\"%\",IF(G10<1,カロリー計算!G9*マグネシウム!G10*10,カロリー計算!G9*マグネシウム!G10/100),IF(H10=\"Kcal/Kg\",カロリー計算!G9*G10/1000,IF(H10=\"mg/Kg\",カロリー計算!G9*G10/1000,IF(H10=\"IU/Kg\",カロリー計算!G9*G10/1000,G10))))","v":0},"---",null,null,null,0]
[null,{"$f":"カロリー計算!$C$10","v":"　"},null,null,null,{"$f":"カロリー計算!$D$10","v":0},null,null,{"$f":"IF(H11=\"%\",IF(G11<1,カロリー計算!G10*マグネシウム!G11*10,カロリー計算!G10*マグネシウム!G11/100),IF(H11=\"Kcal/Kg\",カロリー計算!G10*G11/1000,IF(H11=\"mg/Kg\",カロリー計算!G10*G11/1000,IF(H11=\"IU/Kg\",カロリー計算!G10*G11/1000,G11))))","v":0},"---",null,null,null,0]
[null,{"$f":"カロリー計算!$C$11","v":"　"},null,null,null,{"$f":"カロリー計算!$D$11","v":0},null,null,{"$f":"IF(H12=\"%\",IF(G12<1,カロリー計算!G11*マグネシウム!G12*10,カロリー計算!G11*マグネシウム!G12/100),IF(H12=\"Kcal/Kg\",カロリー計算!G11*G12/1000,IF(H12=\"mg/Kg\",カロリー計算!G11*G12/1000,IF(H12=\"IU/Kg\",カロリー計算!G11*G12/1000,G12))))","v":0},"---",null,null,null,0]
[null,{"$f":"カロリー計算!$C$12","v":"　"},null,null,null,{"$f":"カロリー計算!$D$12","v":0},null,null,{"$f":"IF(H13=\"%\",IF(G13<1,カロリー計算!G12*マグネシウム!G13*10,カロリー計算!G12*マグネシウム!G13/100),IF(H13=\"Kcal/Kg\",カロリー計算!G12*G13/1000,IF(H13=\"mg/Kg\",カロリー計算!G12*G13/1000,IF(H13=\"IU/Kg\",カロリー計算!G12*G13/1000,G13))))","v":0},"---",null,null,null,0]
[null,{"$f":"カロリー計算!$C$13","v":"　"},null,null,null,{"$f":"カロリー計算!$D$13","v":0},null,null,{"$f":"IF(H14=\"%\",IF(G14<1,カロリー計算!G13*マグネシウム!G14*10,カロリー計算!G13*マグネシウム!G14/100),IF(H14=\"Kcal/Kg\",カロリー計算!G13*G14/1000,IF(H14=\"mg/Kg\",カロリー計算!G13*G14/1000,IF(H14=\"IU/Kg\",カロリー計算!G13*G14/1000,G14))))","v":0},"---",null,null,null,0]
[null,{"$f":"カロリー計算!$C$14","v":"　"},null,null,null,{"$f":"カロリー計算!$D$14","v":0},0,null,{"$f":"IF(H15=\"%\",IF(G15<1,カロリー計算!G14*マグネシウム!G15*10,カロリー計算!G14*マグネシウム!G15/100),IF(H15=\"Kcal/Kg\",カロリー計算!G14*G15/1000,IF(H15=\"mg/Kg\",カロリー計算!G14*G15/1000,IF(H15=\"IU/Kg\",カロリー計算!G14*G15/1000,G15))))","v":0},"---",null,null,null,0]
[null,{"$f":"カロリー計算!$C$15","v":"　"},null,null,null,{"$f":"カロリー計算!$D$15","v":0},null,null,{"$f":"IF(H16=\"%\",IF(G16<1,カロリー計算!G15*マグネシウム!G16*10,カロリー計算!G15*マグネシウム!G16/100),IF(H16=\"Kcal/Kg\",カロリー計算!G15*G16/1000,IF(H16=\"mg/Kg\",カロリー計算!G15*G16/1000,IF(H16=\"IU/Kg\",カロリー計算!G15*G16/1000,G16))))","v":0},"---",null,null,null,0]
[null,{"$f":"カロリー計算!$C$16","v":"　"},null,null,null,{"$f":"カロリー計算!$D$16","v":0},null,null,{"$f":"IF(H17=\"%\",IF(G17<1,カロリー計算!G16*マグネシウム!G17*10,カロリー計算!G16*マグネシウム!G17/100),IF(H17=\"Kcal/Kg\",カロリー計算!G16*G17/1000,IF(H17=\"mg/Kg\",カロリー計算!G16*G17/1000,IF(H17=\"IU/Kg\",カロリー計算!G16*G17/1000,G17))))","v":0},"---",null,null,null,0]
[null,{"$f":"カロリー計算!$C$17","v":"　"},null,null,null,{"$f":"カロリー計算!$D$17","v":0},0,null,{"$f":"IF(H18=\"%\",IF(G18<1,カロリー計算!G17*マグネシウム!G18*10,カロリー計算!G17*マグネシウム!G18/100),IF(H18=\"Kcal/Kg\",カロリー計算!G17*G18/1000,IF(H18=\"mg/Kg\",カロリー計算!G17*G18/1000,IF(H18=\"IU/Kg\",カロリー計算!G17*G18/1000,G18))))","v":0},"---",null,null,null,0]
[null,{"$f":"カロリー計算!B19","v":"2023-09-30"},null,null,"更新",null,"合  計  ",null,{"$f":"N19","v":40.5},"mg",null,null,null,{"$f":"IF(J19=\"g\",SUM(N5:N18)/1000,SUM(N5:N18))","v":40.5}]
[null,"体重1キロ当りの制限値",null,20,null,{"$f":"IF(J19=\"mg\",\"mg/Kg\",IF(J19=\"g\",\"g/Kg\",IF(J19=\"IU\",\"IU/Kg\",IF(J19=\"Kcal\",\"Kcal/Kg\",\"－－－\"))))","v":"mg/Kg"},{"$f":"IF(J3=\"無判定\",CONCATENATE(J3,\"  \"),CONCATENATE(J3,\" 制限値  \"))","v":"Max 制限値  "},null,{"$f":"カロリー計算!E19*マグネシウム!D20","v":117},{"$f":"J19","v":"mg"}]
[null,"過不足　・　判　定　",null,null,null,null,null,null,{"$f":"I19-I20","v":-76.5},{"$f":"IF(J3=\"Max\",IF(I19>I20,\"超過\",\"OK\"),IF(J3=\"Min\",IF(I19<I20,\"不足\",\"OK\"),\" \"))","v":"OK"}]
[]
[null,"MEMO :"]

{"sheet":"カルシウム","index":2,"n_rows":24,"n_cols":14,"rows_kept":24,"cut":false,"hidden":false,"merged":[[18,1,18,3],[18,4,18,5],[18,6,18,7],[23,1,23,9],[20,1,20,7],[19,1,19,2],[19,3,19,4],[19,6,19,7],[24,1,24,9],[28,1,28,9],[29,1,29,9],[30,1,30,9],[25,1,25,9],[26,1,26,9],[27,1,27,9],[1,1,1,9],[13,1,13,4],[14,1,14,4],[15,1,15,4],[3,8,3,9],[11,1,11,4],[6,1,6,4],[7,1,7,4],[8,1,8,4],[17,1,17,4],[2,4,2,7],[3,6,3,7],[16,1,16,4],[3,1,3,4],[4,1,4,4],[9,1,9,4],[10,1,10,4],[12,1,12,4],[5,1,5,4]]}
[]
[null,{"$f":"CONCATENATE(カロリー計算!B2,\" の栄養素管理\")","v":"みる 2014/1/28生 の栄養素管理"}]
[null,"種　別","ミネラル","管　理\n成分名","カルシウム",null,null,null,"判定法","Min"]
[null,"フード名",null,null,null,"タイプ","含有量／単位",null,"一日摂取量",null,null,null,null,"印刷範囲外計算枠"]
[null,{"$f":"カロリー計算!$C$4","v":"FHN　エクシジェント42"},null,null,null,{"$f":"カロリー計算!$D$4","v":"ドライ"},1.3,"%",{"$f":"IF(H5=\"%\",IF(G5<1,カロリー計算!G4*カルシウム!G5*10,カロリー計算!G4*カルシウム!G5/100),IF(H5=\"Kcal/Kg\",カロリー計算!G4*G5/1000,IF(H5=\"mg/Kg\",カロリー計算!G4*G5/1000,IF(H5=\"IU/Kg\",カロリー計算!G4*G5/1000,G5))))","v":0.10400000000000001},{"$f":"IF(H5=\"%\",IF(G5<1,\"mg\",\"g\"),IF(H5=\"Kcal/Kg\",\"Kcal\",IF(H5=\"mg/Kg\",\"mg\",IF(H5=\"IU/Kg\",\"IU\",IF(H5=\"pH\",\"pH\",\"---\")))))","v":"g"},null,null,null,{"$f":"IF(J5=\"g\",INT(I5*1000),IF(J5=\"pH\",0,I5))","v":104}]
[null,{"$f":"カロリー計算!$C$5","v":"FHN　インドア　7+"},null,null,null,{"$f":"カロリー計算!$D$5","v":"ドライ"},0.79,"%",{"$f":"IF(H6=\"%\",IF(G6<1,カロリー計算!G5*カルシウム!G6*10,カロリー計算!G5*カルシウム!G6/100),IF(H6=\"Kcal/Kg\",カロリー計算!G5*G6/1000,IF(H6=\"mg/Kg\",カロリー計算!G5*G6/1000,IF(H6=\"IU/Kg\",カロリー計算!G5*G6/1000,G6))))","v":63.2},"mg",null,null,null,63.2]
[null,{"$f":"カロリー計算!$C$6","v":"FHN ステアライズド　7+"},null,null,null,{"$f":"カロリー計算!$D$6","v":"ドライ"},1,"%",{"$f":"IF(H7=\"%\",IF(G7<1,カロリー計算!G6*カルシウム!G7*10,カロリー計算!G6*カルシウム!G7/100),IF(H7=\"Kcal/Kg\",カロリー計算!G6*G7/1000,IF(H7=\"mg/Kg\",カロリー計算!G6*G7/1000,IF(H7=\"IU/Kg\",カロリー計算!G6*G7/1000,G7))))","v":0.08},"g",null,null,null,80]
[null,{"$f":"カロリー計算!$C$7","v":"ウルトラライト (85g　パウチ)"},null,null,null,{"$f":"カロリー計算!$D$7","v":"ウェット"},0.39,"%",{"$f":"IF(H8=\"%\",IF(G8<1,カロリー計算!G7*カルシウム!G8*10,カロリー計算!G7*カルシウム!G8/100),IF(H8=\"Kcal/Kg\",カロリー計算!G7*G8/1000,IF(H8=\"mg/Kg\",カロリー計算!G7*G8/1000,IF(H8=\"IU/Kg\",カロリー計算!G7*G8/1000,G8))))","v":331.5},"mg",null,null,null,331.5]
[null,{"$f":"カロリー計算!$C$8","v":"おやつ各種、少量"},null,null,null,{"$f":"カロリー計算!$D$8","v":"おやつ"},null,null,{"$f":"IF(H9=\"%\",IF(G9<1,カロリー計算!G8*カルシウム!G9*10,カロリー計算!G8*カルシウム!G9/100),IF(H9=\"Kcal/Kg\",カロリー計算!G8*G9/1000,IF(H9=\"mg/Kg\",カロリー計算!G8*G9/1000,IF(H9=\"IU/Kg\",カロリー計算!G8*G9/1000,G9))))","v":0},"---",null,null,null,0]
[null,{"$f":"カロリー計算!$C$9","v":"　"},null,null,null,{"$f":"カロリー計算!$D$9","v":0},null,null,{"$f":"IF(H10=\"%\",IF(G10<1,カロリー計算!G9*カルシウム!G10*10,カロリー計算!G9*カルシウム!G10/100),IF(H10=\"Kcal/Kg\",カロリー計算!G9*G10/1000,IF(H10=\"mg/Kg\",カロリー計算!G9*G10/1000,IF(H10=\"IU/Kg\",カロリー計算!G9*G10/1000,G10))))","v":0},"---",null,null,null,0]
[null,{"$f":"カロリー計算!$C$10","v":"　"},null,null,null,{"$f":"カロリー計算!$D$10","v":0},null,null,{"$f":"IF(H11=\"%\",IF(G11<1,カロリー計算!G10*カルシウム!G11*10,カロリー計算!G10*カルシウム!G11/100),IF(H11=\"Kcal/Kg\",カロリー計算!G10*G11/1000,IF(H11=\"mg/Kg\",カロリー計算!G10*G11/1000,IF(H11=\"IU/Kg\",カロリー計算!G10*G11/1000,G11))))","v":0},"---",null,null,null,0]
[null,{"$f":"カロリー計算!$C$11","v":"　"},null,null,null,{"$f":"カロリー計算!$D$11","v":0},null,null,{"$f":"IF(H12=\"%\",IF(G12<1,カロリー計算!G11*カルシウム!G12*10,カロリー計算!G11*カルシウム!G12/100),IF(H12=\"Kcal/Kg\",カロリー計算!G11*G12/1000,IF(H12=\"mg/Kg\",カロリー計算!G11*G12/1000,IF(H12=\"IU/Kg\",カロリー計算!G11*G12/1000,G12))))","v":0},"---",null,null,null,0]
[null,{"$f":"カロリー計算!$C$12","v":"　"},null,null,null,{"$f":"カロリー計算!$D$12","v":0},null,null,{"$f":"IF(H13=\"%\",IF(G13<1,カロリー計算!G12*カルシウム!G13*10,カロリー計算!G12*カルシウム!G13/100),IF(H13=\"Kcal/Kg\",カロリー計算!G12*G13/1000,IF(H13=\"mg/Kg\",カロリー計算!G12*G13/1000,IF(H13=\"IU/Kg\",カロリー計算!G12*G13/1000,G13))))","v":0},"---",null,null,null,0]
[null,{"$f":"カロリー計算!$C$13","v":"　"},null,null,null,{"$f":"カロリー計算!$D$13","v":0},null,null,{"$f":"IF(H14=\"%\",IF(G14<1,カロリー計算!G13*カルシウム!G14*10,カロリー計算!G13*カルシウム!G14/100),IF(H14=\"Kcal/Kg\",カロリー計算!G13*G14/1000,IF(H14=\"mg/Kg\",カロリー計算!G13*G14/1000,IF(H14=\"IU/Kg\",カロリー計算!G13*G14/1000,G14))))","v":0},"---",null,null,null,0]
[null,{"$f":"カロリー計算!$C$14","v":"　"},null,null,null,{"$f":"カロリー計算!$D$14","v":0},0,null,{"$f":"IF(H15=\"%\",IF(G15<1,カロリー計算!G14*カルシウム!G15*10,カロリー計算!G14*カルシウム!G15/100),IF(H15=\"Kcal/Kg\",カロリー計算!G14*G15/1000,IF(H15=\"mg/Kg\",カロリー計算!G14*G15/1000,IF(H15=\"IU/Kg\",カロリー計算!G14*G15/1000,G15))))","v":0},"---",null,null,null,0]
[null,{"$f":"カロリー計算!$C$15","v":"　"},null,null,null,{"$f":"カロリー計算!$D$15","v":0},null,null,{"$f":"IF(H16=\"%\",IF(G16<1,カロリー計算!G15*カルシウム!G16*10,カロリー計算!G15*カルシウム!G16/100),IF(H16=\"Kcal/Kg\",カロリー計算!G15*G16/1000,IF(H16=\"mg/Kg\",カロリー計算!G15*G16/1000,IF(H16=\"IU/Kg\",カロリー計算!G15*G16/1000,G16))))","v":0},"---",null,null,null,0]
[null,{"$f":"カロリー計算!$C$16","v":"　"},null,null,null,{"$f":"カロリー計算!$D$16","v":0},null,null,{"$f":"IF(H17=\"%\",IF(G17<1,カロリー計算!G16*カルシウム!G17*10,カロリー計算!G16*カルシウム!G17/100),IF(H17=\"Kcal/Kg\",カロリー計算!G16*G17/1000,IF(H17=\"mg/Kg\",カロリー計算!G16*G17/1000,IF(H17=\"IU/Kg\",カロリー計算!G16*G17/1000,G17))))","v":0},"---",null,null,null,0]
[null,{"$f":"カロリー計算!$C$17","v":"　"},null,null,null,{"$f":"カロリー計算!$D$17","v":0},0,null,{"$f":"IF(H18=\"%\",IF(G18<1,カロリー計算!G17*カルシウム!G18*10,カロリー計算!G17*カルシウム!G18/100),IF(H18=\"Kcal/Kg\",カロリー計算!G17*G18/1000,IF(H18=\"mg/Kg\",カロリー計算!G17*G18/1000,IF(H18=\"IU/Kg\",カロリー計算!G17*G18/1000,G18))))","v":0},"---",null,null,null,0]
[null,{"$f":"カロリー計算!B19","v":"2023-09-30"},null,null,"更新",null,"合  計  ",null,{"$f":"N19","v":578.70000000000005},"mg",null,null,null,{"$f":"IF(J19=\"g\",SUM(N5:N18)/1000,SUM(N5:N18))","v":578.70000000000005}]
[null,"体重1キロ当りの制限値",null,80,null,{"$f":"IF(J19=\"mg\",\"mg/Kg\",IF(J19=\"g\",\"g/Kg\",IF(J19=\"IU\",\"IU/Kg\",IF(J19=\"Kcal\",\"Kcal/Kg\",\"－－－\"))))","v":"mg/Kg"},{"$f":"IF(J3=\"無判定\",CONCATENATE(J3,\"  \"),CONCATENATE(J3,\" 制限値  \"))","v":"Min 制限値  "},null,{"$f":"カロリー計算!E19*カルシウム!D20","v":468},{"$f":"J19","v":"mg"}]
[null,"過不足　・　判　定　",null,null,null,null,null,null,{"$f":"I19-I20","v":110.70000000000005},{"$f":"IF(J3=\"Max\",IF(I19>I20,\"超過\",\"OK\"),IF(J3=\"Min\",IF(I19<I20,\"不足\",\"OK\"),\" \"))","v":"OK"}]
[]
[null,"MEMO :"]
[null,"成長期(10～40週)は150mg/Kg、維持期は80mg/Kg"]

{"sheet":"成分追加用マスター","index":3,"n_rows":23,"n_cols":14,"rows_kept":23,"cut":false,"hidden":false,"merged":[[1,1,1,9],[13,1,13,4],[14,1,14,4],[15,1,15,4],[12,1,12,4],[5,1,5,4],[6,1,6,4],[7,1,7,4],[8,1,8,4],[3,1,3,4],[3,8,3,9],[11,1,11,4],[17,1,17,4],[2,4,2,7],[3,6,3,7],[16,1,16,4],[4,1,4,4],[9,1,9,4],[10,1,10,4],[24,1,24,9],[28,1,28,9],[29,1,29,9],[30,1,30,9],[25,1,25,9],[26,1,26,9],[27,1,27,9],[18,1,18,3],[18,4,18,5],[18,6,18,7],[23,1,23,9],[20,1,20,7],[19,1,19,2],[19,3,19,4],[19,6,19,7]]}
[]
[null,{"$f":"CONCATENATE(カロリー計算!B2,\" の栄養素管理\")","v":"みる 2014/1/28生 の栄養素管理"}]
[null,"種　別",null,"管　理\n成分名","予備・成分の追加はこのシートをコピーする。",null,null,null,"判定法","Max"]
[null,"フード名",null,null,null,"タイプ","含有量／単位",null,"一日摂取量",null,null,null,null,"印刷範囲外計算枠"]
[null,{"$f":"カロリー計算!$C$4","v":"FHN　エクシジェント42"},null,null,null,{"$f":"カロリー計算!$D$4","v":"ドライ"},0,"%",{"$f":"IF(H5=\"%\",IF(G5<1,カロリー計算!G4*成分追加用マスター!G5*10,カロリー計算!G4*成分追加用マスター!G5/100),IF(H5=\"Kcal/Kg\",カロリー計算!G4*G5/1000,IF(H5=\"mg/Kg\",カロリー計算!G4*G5/1000,IF(H5=\"IU/Kg\",カロリー計算!G4*G5/1000,G5))))","v":0},{"$f":"IF(H5=\"%\",IF(G5<1,\"mg\",\"g\"),IF(H5=\"Kcal/Kg\",\"Kcal\",IF(H5=\"mg/Kg\",\"mg\",IF(H5=\"IU/Kg\",\"IU\",IF(H5=\"pH\",\"pH\",\"---\")))))","v":"mg"},null,null,null,{"$f":"IF(J5=\"g\",INT(I5*1000),IF(J5=\"pH\",0,I5))","v":0}]
[null,{"$f":"カロリー計算!$C$5","v":"FHN　インドア　7+"},null,null,null,{"$f":"カロリー計算!$D$5","v":"ドライ"},0,"%",{"$f":"IF(H6=\"%\",IF(G6<1,カロリー計算!G5*成分追加用マスター!G6*10,カロリー計算!G5*成分追加用マスター!G6/100),IF(H6=\"Kcal/Kg\",カロリー計算!G5*G6/1000,IF(H6=\"mg/Kg\",カロリー計算!G5*G6/1000,IF(H6=\"IU/Kg\",カロリー計算!G5*G6/1000,G6))))","v":0},"mg",null,null,null,0]
[null,{"$f":"カロリー計算!$C$6","v":"FHN ステアライズド　7+"},null,null,null,{"$f":"カロリー計算!$D$6","v":"ドライ"},0,"%",{"$f":"IF(H7=\"%\",IF(G7<1,カロリー計算!G6*成分追加用マスター!G7*10,カロリー計算!G6*成分追加用マスター!G7/100),IF(H7=\"Kcal/Kg\",カロリー計算!G6*G7/1000,IF(H7=\"mg/Kg\",カロリー計算!G6*G7/1000,IF(H7=\"IU/Kg\",カロリー計算!G6*G7/1000,G7))))","v":0},"mg",null,null,null,0]
[null,{"$f":"カロリー計算!$C$7","v":"ウルトラライト (85g　パウチ)"},null,null,null,{"$f":"カロリー計算!$D$7","v":"ウェット"},0,"%",{"$f":"IF(H8=\"%\",IF(G8<1,カロリー計算!G7*成分追加用マスター!G8*10,カロリー計算!G7*成分追加用マスター!G8/100),IF(H8=\"Kcal/Kg\",カロリー計算!G7*G8/1000,IF(H8=\"mg/Kg\",カロリー計算!G7*G8/1000,IF(H8=\"IU/Kg\",カロリー計算!G7*G8/1000,G8))))","v":0},"mg",null,null,null,0]
[null,{"$f":"カロリー計算!$C$8","v":"おやつ各種、少量"},null,null,null,{"$f":"カロリー計算!$D$8","v":"おやつ"},0,null,{"$f":"IF(H9=\"%\",IF(G9<1,カロリー計算!G8*成分追加用マスター!G9*10,カロリー計算!G8*成分追加用マスター!G9/100),IF(H9=\"Kcal/Kg\",カロリー計算!G8*G9/1000,IF(H9=\"mg/Kg\",カロリー計算!G8*G9/1000,IF(H9=\"IU/Kg\",カロリー計算!G8*G9/1000,G9))))","v":0},"---",null,null,null,0]
[null,{"$f":"カロリー計算!$C$9","v":"　"},null,null,null,{"$f":"カロリー計算!$D$9","v":0},0,null,{"$f":"IF(H10=\"%\",IF(G10<1,カロリー計算!G9*成分追加用マスター!G10*10,カロリー計算!G9*成分追加用マスター!G10/100),IF(H10=\"Kcal/Kg\",カロリー計算!G9*G10/1000,IF(H10=\"mg/Kg\",カロリー計算!G9*G10/1000,IF(H10=\"IU/Kg\",カロリー計算!G9*G10/1000,G10))))","v":0},"---",null,null,null,0]
[null,{"$f":"カロリー計算!$C$10","v":"　"},null,null,null,{"$f":"カロリー計算!$D$10","v":0},0,null,{"$f":"IF(H11=\"%\",IF(G11<1,カロリー計算!G10*成分追加用マスター!G11*10,カロリー計算!G10*成分追加用マスター!G11/100),IF(H11=\"Kcal/Kg\",カロリー計算!G10*G11/1000,IF(H11=\"mg/Kg\",カロリー計算!G10*G11/1000,IF(H11=\"IU/Kg\",カロリー計算!G10*G11/1000,G11))))","v":0},"---",null,null,null,0]
[null,{"$f":"カロリー計算!$C$11","v":"　"},null,null,null,{"$f":"カロリー計算!$D$11","v":0},0,null,{"$f":"IF(H12=\"%\",IF(G12<1,カロリー計算!G11*成分追加用マスター!G12*10,カロリー計算!G11*成分追加用マスター!G12/100),IF(H12=\"Kcal/Kg\",カロリー計算!G11*G12/1000,IF(H12=\"mg/Kg\",カロリー計算!G11*G12/1000,IF(H12=\"IU/Kg\",カロリー計算!G11*G12/1000,G12))))","v":0},"---",null,null,null,0]
[null,{"$f":"カロリー計算!$C$12","v":"　"},null,null,null,{"$f":"カロリー計算!$D$12","v":0},0,null,{"$f":"IF(H13=\"%\",IF(G13<1,カロリー計算!G12*成分追加用マスター!G13*10,カロリー計算!G12*成分追加用マスター!G13/100),IF(H13=\"Kcal/Kg\",カロリー計算!G12*G13/1000,IF(H13=\"mg/Kg\",カロリー計算!G12*G13/1000,IF(H13=\"IU/Kg\",カロリー計算!G12*G13/1000,G13))))","v":0},"---",null,null,null,0]
[null,{"$f":"カロリー計算!$C$13","v":"　"},null,null,null,{"$f":"カロリー計算!$D$13","v":0},0,null,{"$f":"IF(H14=\"%\",IF(G14<1,カロリー計算!G13*成分追加用マスター!G14*10,カロリー計算!G13*成分追加用マスター!G14/100),IF(H14=\"Kcal/Kg\",カロリー計算!G13*G14/1000,IF(H14=\"mg/Kg\",カロリー計算!G13*G14/1000,IF(H14=\"IU/Kg\",カロリー計算!G13*G14/1000,G14))))","v":0},"---",null,null,null,0]
[null,{"$f":"カロリー計算!$C$14","v":"　"},null,null,null,{"$f":"カロリー計算!$D$14","v":0},0,null,{"$f":"IF(H15=\"%\",IF(G15<1,カロリー計算!G14*成分追加用マスター!G15*10,カロリー計算!G14*成分追加用マスター!G15/100),IF(H15=\"Kcal/Kg\",カロリー計算!G14*G15/1000,IF(H15=\"mg/Kg\",カロリー計算!G14*G15/1000,IF(H15=\"IU/Kg\",カロリー計算!G14*G15/1000,G15))))","v":0},"---",null,null,null,0]
[null,{"$f":"カロリー計算!$C$15","v":"　"},null,null,null,{"$f":"カロリー計算!$D$15","v":0},0,null,{"$f":"IF(H16=\"%\",IF(G16<1,カロリー計算!G15*成分追加用マスター!G16*10,カロリー計算!G15*成分追加用マスター!G16/100),IF(H16=\"Kcal/Kg\",カロリー計算!G15*G16/1000,IF(H16=\"mg/Kg\",カロリー計算!G15*G16/1000,IF(H16=\"IU/Kg\",カロリー計算!G15*G16/1000,G16))))","v":0},"---",null,null,null,0]
[null,{"$f":"カロリー計算!$C$16","v":"　"},null,null,null,{"$f":"カロリー計算!$D$16","v":0},0,null,{"$f":"IF(H17=\"%\",IF(G17<1,カロリー計算!G16*成分追加用マスター!G17*10,カロリー計算!G16*成分追加用マスター!G17/100),IF(H17=\"Kcal/Kg\",カロリー計算!G16*G17/1000,IF(H17=\"mg/Kg\",カロリー計算!G16*G17/1000,IF(H17=\"IU/Kg\",カロリー計算!G16*G17/1000,G17))))","v":0},"---",null,null,null,0]
[null,{"$f":"カロリー計算!$C$17","v":"　"},null,null,null,{"$f":"カロリー計算!$D$17","v":0},0,null,{"$f":"IF(H18=\"%\",IF(G18<1,カロリー計算!G17*成分追加用マスター!G18*10,カロリー計算!G17*成分追加用マスター!G18/100),IF(H18=\"Kcal/Kg\",カロリー計算!G17*G18/1000,IF(H18=\"mg/Kg\",カロリー計算!G17*G18/1000,IF(H18=\"IU/Kg\",カロリー計算!G17*G18/1000,G18))))","v":0},"---",null,null,null,0]
[null,{"$f":"カロリー計算!B19","v":"2023-09-30"},null,null,"更新",null,"合  計  ",null,{"$f":"N19","v":0},"mg",null,null,null,{"$f":"IF(J19=\"g\",SUM(N5:N18)/1000,SUM(N5:N18))","v":0}]
[null,"体重1キロ当りの制限値",null,0,null,{"$f":"IF(J19=\"mg\",\"mg/Kg\",IF(J19=\"g\",\"g/Kg\",IF(J19=\"IU\",\"IU/Kg\",IF(J19=\"Kcal\",\"Kcal/Kg\",\"－－－\"))))","v":"mg/Kg"},{"$f":"IF(J3=\"無判定\",CONCATENATE(J3,\"  \"),CONCATENATE(J3,\" 制限値  \"))","v":"Max 制限値  "},null,{"$f":"カロリー計算!E19*成分追加用マスター!D20","v":0},{"$f":"J19","v":"mg"}]
[null,"過不足　・　判　定　",null,null,null,null,null,null,{"$f":"I19-I20","v":0},{"$f":"IF(J3=\"Max\",IF(I19>I20,\"超過\",\"OK\"),IF(J3=\"Min\",IF(I19<I20,\"不足\",\"OK\"),\" \"))","v":"OK"}]
[]
[null,"MEMO :"]

{"sheet":"体重の記録","index":4,"n_rows":241,"n_cols":6,"rows_kept":241,"cut":false,"hidden":false,"merged":[]}
["計測日","月齢(自動)","年齢(自動)","体重",null,"グラフ表示用"]
["2014-01-28",0,0,5.93,null,0]
["2015-03-15",{"$f":"IF(A3=\"\",\"\",INT((A3-$A$2)/365.25*12))","v":13},{"$f":"IF(B3=\"\",\"\",B3/12)","v":1.0833333333333333},5.93,null,{"$f":"IF(B3=\"\",\"\",INT(B3/12))","v":1}]
["2015-04-21",{"$f":"IF(A4=\"\",\"\",INT((A4-$A$2)/365.25*12))","v":14},{"$f":"IF(B4=\"\",\"\",B4/12)","v":1.1666666666666667},6.36,null,{"$f":"IF(B4=\"\",\"\",INT(B4/12))","v":1}]
["2015-06-02",16,1.3333333333333333,6.6,null,1]
["2015-07-01",17,1.4166666666666667,6.77,null,1]
["2015-07-31",18,1.5,6.6,null,1]
["2015-09-03",19,1.5833333333333333,6.8,null,1]
["2015-09-30",20,1.6666666666666667,6.8,null,1]
["2015-10-31",21,1.75,7,null,1]
["2015-12-02",22,1.8333333333333333,7,null,1]
["2016-01-09",23,1.9166666666666667,7.3,null,1]
["2016-01-31",24,2,7,null,2]
["2016-02-29",25,2.0833333333333335,7,null,2]
["2016-03-30",26,2.1666666666666665,7,null,2]
["2016-04-30",27,2.25,7,null,2]
["2016-05-30",28,2.3333333333333335,7.2,null,2]
["2016-07-03",29,2.4166666666666665,6.9,null,2]
["2016-07-31",30,2.5,6.9,null,2]
["2016-08-31",31,2.5833333333333335,7.1,null,2]
["2016-09-30",32,2.6666666666666665,6.9,null,2]
["2016-10-30",33,2.75,6.8,null,2]
["2016-11-29",34,2.8333333333333335,7.3,null,2]
["2016-12-31",35,2.9166666666666665,6.5,null,2]
["2017-01-31",36,3,6.6,null,3]
["2017-03-01",37,3.0833333333333335,6.6,null,3]
["2017-03-30",38,3.1666666666666665,6.8,null,3]
["2017-04-30",39,3.25,6.5,null,3]
["2017-05-31",40,3.3333333333333335,6.5,null,3]
["2017-06-30",41,3.4166666666666665,6.5,null,3]
["2017-07-30",42,3.5,6.5,null,3]
["2017-09-30",44,3.6666666666666665,6.1,null,3]
["2017-10-31",45,3.75,5.9,null,3]
["2017-11-30",46,3.8333333333333335,6.5,null,3]
["2017-12-31",47,3.9166666666666665,6.4,null,3]
["2018-02-07",48,4,6.2,null,4]
["2018-02-28",49,4.083333333333333,6.2,null,4]
["2018-03-31",50,4.166666666666667,6.5,null,4]
["2018-04-30",51,4.25,6.7,null,4]
["2018-05-31",52,4.333333333333333,6.2,null,4]
["2018-06-30",53,4.416666666666667,6.4,null,4]
["2018-07-31",54,4.5,6.4,null,4]
["2018-08-31",55,4.583333333333333,6.5,null,4]
["2018-09-30",56,4.666666666666667,6.1,null,4]
["2018-10-31",57,4.75,6.2,null,4]
["2018-11-30",58,4.833333333333333,6.7,null,4]
["2018-12-31",59,4.916666666666667,6.4,null,4]
["2019-01-31",60,5,6.2,null,5]
["2019-02-28",61,5.083333333333333,6.2,null,5]
["2019-03-31",62,5.166666666666667,6,null,5]
["2019-04-30",63,5.25,6,null,5]
["2019-05-31",64,5.333333333333333,6,null,5]
["2019-06-30",65,5.416666666666667,6.2,null,5]
["2019-07-31",66,5.5,6,null,5]
["2019-08-31",67,5.583333333333333,6,null,5]
["2019-09-30",68,5.666666666666667,6,null,5]
["2019-10-31",69,5.75,6,null,5]
["2019-11-30",70,5.833333333333333,6.2,null,5]
["2019-12-31",71,5.916666666666667,6.4,null,5]
["2020-01-31",72,6,6.2,null,6]
["2020-02-29",73,6.083333333333333,6.4,null,6]
["2020-03-31",74,6.166666666666667,6.2,null,6]
["2020-04-30",75,6.25,6.2,null,6]
["2020-05-31",76,6.333333333333333,5.8,null,6]
["2020-06-30",77,6.416666666666667,6,null,6]
["2020-07-31",78,6.5,6.1,null,6]
["2020-09-30",80,6.666666666666667,6,null,6]
["2020-10-31",{"$f":"IF(A68=\"\",\"\",INT((A68-$A$2)/365.25*12))","v":81},{"$f":"IF(B68=\"\",\"\",B68/12)","v":6.75},6,null,{"$f":"IF(B68=\"\",\"\",INT(B68/12))","v":6}]
["2020-11-30",82,6.833333333333333,6.2,null,6]
["2020-12-31",83,6.916666666666667,5.8,null,6]
["2021-01-31",84,7,5.8,null,7]
["2021-03-31",86,7.166666666666667,5.8,null,7]
["2021-04-30",87,7.25,5.8,null,7]
["2021-06-01",88,7.333333333333333,6,null,7]
["2021-06-30",89,7.416666666666667,5.8,null,7]
["2021-07-31",90,7.5,5.6,null,7]
["2021-09-30",92,7.666666666666667,6,null,7]
["2021-10-31",93,7.75,6,null,7]
["2021-11-30",94,7.833333333333333,6,null,7]
["2021-12-31",95,7.916666666666667,6.2,null,7]
["2022-01-31",96,8,6.15,null,8]
["2022-03-31",98,8.1666666666666661,6.15,null,8]
["2022-04-30",99,8.25,6.15,null,8]
["2022-05-31",100,8.3333333333333339,6.15,null,8]
["2022-06-30",101,8.4166666666666661,6.15,null,8]
["2022-07-30",102,8.5,6.2,null,8]
["2022-08-30",103,8.5833333333333339,6.15,null,8]
["2022-09-30",104,8.6666666666666661,6.25,null,8]
["2022-11-30",106,8.8333333333333339,6,null,8]
["2022-12-31",107,8.9166666666666661,6.05,null,8]
["2023-01-31",108,9,5.8,null,9]
["2023-02-28",109,9.0833333333333339,5.75,null,9]
["2023-03-31",110,9.1666666666666661,5.85,null,9]
["2023-04-30",111,9.25,5.85,null,9]
["2023-05-31",112,9.3333333333333339,5.8,null,9]
["2023-06-30",113,9.4166666666666661,5.9,null,9]
["2023-07-31",114,9.5,5.9,null,9]
["2023-08-31",115,9.5833333333333339,5.8,null,9]
["2023-09-30",116,9.6666666666666661,5.85,null,9]
[null,"","",{"$f":"D99","v":5.85},null,""]
[null,"","",5.85,null,""]
[null,"","",5.85,null,""]
[null,"","",5.85,null,""]
[null,"","",5.85,null,""]
[null,"","",5.85,null,""]
[null,"","",5.85,null,""]
[null,"","",5.85,null,""]
[null,"","",5.85,null,""]
[null,"","",5.85,null,""]
[null,"","",5.85,null,""]
[null,"","",5.85,null,""]
[null,"","",5.85,null,""]
[null,"","",5.85,null,""]
[null,"","",5.85,null,""]
[null,"","",5.85,null,""]
[null,"","",5.85,null,""]
[null,"","",5.85,null,""]
[null,"","",5.85,null,""]
[null,"","",5.85,null,""]
[null,"","",5.85,null,""]
[null,"","",5.85,null,""]
[null,"","",5.85,null,""]
[null,"","",5.85,null,""]
[null,"","",5.85,null,""]
[null,"","",5.85,null,""]
[null,"","",5.85,null,""]
[null,"","",5.85,null,""]
[null,"","",5.85,null,""]
[null,"","",5.85,null,""]
[null,"","",5.85,null,""]
[null,"","",5.85,null,""]
[null,{"$f":"IF(A132=\"\",\"\",INT((A132-$A$2)/365.25*12))","v":""},{"$f":"IF(B132=\"\",\"\",B132/12)","v":""},5.85,null,{"$f":"IF(B132=\"\",\"\",INT(B132/12))","v":""}]
[null,"","",5.85,null,""]
[null,"","",5.85,null,""]
[null,"","",5.85,null,""]
[null,"","",5.85,null,""]
[null,"","",5.85,null,""]
[null,"","",5.85,null,""]
[null,"","",5.85,null,""]
[null,"","",5.85,null,""]
[null,"","",5.85,null,""]
[null,"","",5.85,null,""]
[null,"","",5.85,null,""]
[null,"","",5.85,null,""]
[null,"","",5.85,null,""]
[null,"","",5.85,null,""]
[null,"","",5.85,null,""]
[null,"","",5.85,null,""]
[null,"","",5.85,null,""]
[null,"","",{"$f":"D149","v":5.85},null,""]
[null,"","",5.85,null,""]
[null,"","",5.85,null,""]
[null,"","",5.85,null,""]
[null,"","",5.85,null,""]
[null,"","",5.85,null,""]
[null,"","",5.85,null,""]
[null,"","",5.85,null,""]
[null,"","",5.85,null,""]
[null,"","",5.85,null,""]
[null,"","",5.85,null,""]
[null,"","",5.85,null,""]
[null,"","",5.85,null,""]
[null,"","",5.85,null,""]
[null,"","",5.85,null,""]
[null,"","",5.85,null,""]
[null,"","",5.85,null,""]
[null,"","",5.85,null,""]
[null,"","",5.85,null,""]
[null,"","",5.85,null,""]
[null,"","",5.85,null,""]
[null,"","",5.85,null,""]
[null,"","",{"$f":"D171","v":5.85},null,""]
[null,"","",5.85,null,""]
[null,"","",5.85,null,""]
[null,"","",5.85,null,""]
[null,"","",5.85,null,""]
[null,"","",5.85,null,""]
[null,"","",5.85,null,""]
[null,"","",5.85,null,""]
[null,"","",5.85,null,""]
[null,"","",5.85,null,""]
[null,"","",{"$f":"D181","v":5.85},null,""]
[null,"","",5.85,null,""]
[null,"","",5.85,null,""]
[null,"","",5.85,null,""]
[null,"","",5.85,null,""]
[null,"","",5.85,null,""]
[null,"","",5.85,null,""]
[null,"","",5.85,null,""]
[null,"","",5.85,null,""]
[null,"","",5.85,null,""]
[null,"","",{"$f":"D191","v":5.85},null,""]
[null,"","",5.85,null,""]
[null,"","",5.85,null,""]
[null,"","",5.85,null,""]
[null,{"$f":"IF(A196=\"\",\"\",INT((A196-$A$2)/365.25*12))","v":""},{"$f":"IF(B196=\"\",\"\",B196/12)","v":""},5.85,null,{"$f":"IF(B196=\"\",\"\",INT(B196/12))","v":""}]
[null,"","",5.85,null,""]
[null,"","",5.85,null,""]
[null,"","",5.85,null,""]
[null,"","",5.85,null,""]
[null,"","",5.85,null,""]
[null,"","",{"$f":"D201","v":5.85},null,""]
[null,"","",5.85,null,""]
[null,"","",5.85,null,""]
[null,"","",5.85,null,""]
[null,"","",5.85,null,""]
[null,"","",5.85,null,""]
[null,"","",5.85,null,""]
[null,"","",5.85,null,""]
[null,"","",5.85,null,""]
[null,"","",5.85,null,""]
[null,"","",{"$f":"D211","v":5.85},null,""]
[null,"","",5.85,null,""]
[null,"","",5.85,null,""]
[null,"","",5.85,null,""]
[null,"","",5.85,null,""]
[null,"","",5.85,null,""]
[null,"","",5.85,null,""]
[null,"","",5.85,null,""]
[null,"","",5.85,null,""]
[null,"","",5.85,null,""]
[null,"","",{"$f":"D221","v":5.85},null,""]
[null,"","",{"$f":"D182","v":5.85},null,""]
[null,"","",{"$f":"D223","v":5.85},null,""]
[null,"","",5.85,null,""]
[null,"","",5.85,null,""]
[null,"","",5.85,null,""]
[null,"","",5.85,null,""]
[null,"","",5.85,null,""]
[null,"","",5.85,null,""]
[null,"","",{"$f":"D180","v":5.85},null,""]
[null,"","",{"$f":"D171","v":5.85},null,""]
[null,"","",{"$f":"D232","v":5.85},null,""]
[null,"","",5.85,null,""]
[null,"","",5.85,null,""]
[null,"","",5.85,null,""]
[null,"","",5.85,null,""]
[null,"","",5.85,null,""]
[null,"","",5.85,null,""]
[null,"","",5.85,null,""]
[null,"","",5.85,null,""]

{"sheet":"フードの切替計画書","index":6,"n_rows":37,"n_cols":5,"rows_kept":37,"cut":false,"hidden":false,"merged":[[0,0,0,3],[1,0,1,1],[2,0,2,1],[3,0,3,1],[4,0,4,1],[5,0,5,1]]}
["フード切り替え計画表 (同量移行用)"]
[null,null,"現　　　行","新　　　規"]
["フードの種類",null,"FHN　インドア","FHN　ステアライズド"]
["現在の一日量 (g)",null,30]
["移行単位 (g)",null,5]
["完了までの総使用量",null,{"$f":"SUM(C7:C37)","v":75},{"$f":"SUM(D7:D37)","v":105}]
[1,"2022-10-27",{"$f":"IF(E7>$C$4,\"\",$C$4-E7)","v":25},{"$f":"IF(E7>$C$4,\"\",E7)","v":5},{"$f":"$C$5*A7","v":5}]
[{"$f":"A7+1","v":2},{"$f":"IF(E8>$C$4,\"\",B7+1)","v":"2022-10-28"},{"$f":"IF(E8>$C$4,\"\",$C$4-E8)","v":20},{"$f":"IF(E8>$C$4,\"\",E8)","v":10},{"$f":"$C$5*A8","v":10}]
[{"$f":"A8+1","v":3},{"$f":"IF(E9>$C$4,\"\",B8+1)","v":"2022-10-29"},15,15,15]
[4,"2022-10-30",10,20,20]
[5,"2022-10-31",5,25,25]
[6,"2022-11-01",0,30,30]
[7,"","","",35]
[8,"","","",40]
[9,"","","",45]
[10,"","","",50]
[11,"","","",55]
[12,"","","",60]
[13,"","","",65]
[14,"","","",70]
[{"$f":"A20+1","v":15},"","","",{"$f":"$C$5*A21","v":75}]
[16,"","","",80]
[17,"","","",85]
[18,"","","",90]
[19,"","","",95]
[20,"","","",100]
[21,{"$f":"IF(E27>$C$4,\"\",B22+1)","v":""},"","",105]
[22,{"$f":"IF(E28>$C$4,\"\",B27+1)","v":""},"","",110]
[23,{"$f":"IF(E29>$C$4,\"\",B24+1)","v":""},{"$f":"IF(E29>$C$4,\"\",$C$4-E29)","v":""},{"$f":"IF(E29>$C$4,\"\",E29)","v":""},{"$f":"$C$5*A29","v":115}]
[24,{"$f":"IF(E30>$C$4,\"\",B29+1)","v":""},{"$f":"IF(E30>$C$4,\"\",$C$4-E30)","v":""},{"$f":"IF(E30>$C$4,\"\",E30)","v":""},{"$f":"$C$5*A30","v":120}]
[25,{"$f":"IF(E31>$C$4,\"\",B28+1)","v":""},"","",125]
[26,{"$f":"IF(E32>$C$4,\"\",B31+1)","v":""},"","",130]
[27,{"$f":"IF(E33>$C$4,\"\",B26+1)","v":""},{"$f":"IF(E33>$C$4,\"\",$C$4-E33)","v":""},{"$f":"IF(E33>$C$4,\"\",E33)","v":""},{"$f":"$C$5*A33","v":135}]
[28,{"$f":"IF(E34>$C$4,\"\",B33+1)","v":""},{"$f":"IF(E34>$C$4,\"\",$C$4-E34)","v":""},{"$f":"IF(E34>$C$4,\"\",E34)","v":""},{"$f":"$C$5*A34","v":140}]
[29,{"$f":"IF(E35>$C$4,\"\",B34+1)","v":""},{"$f":"IF(E35>$C$4,\"\",$C$4-E35)","v":""},{"$f":"IF(E35>$C$4,\"\",E35)","v":""},{"$f":"$C$5*A35","v":145}]
[30,{"$f":"IF(E36>$C$4,\"\",B35+1)","v":""},{"$f":"IF(E36>$C$4,\"\",$C$4-E36)","v":""},{"$f":"IF(E36>$C$4,\"\",E36)","v":""},{"$f":"$C$5*A36","v":150}]
[31,{"$f":"IF(E37>$C$4,\"\",B26+1)","v":""},"","",155]